Reaction Details
TargetEpidermal growth factor receptor
LigandBDBM50025502
Substrate/Competitorn/a
Meas. Tech.ChEMBL_506208 (CHEMBL941412)
IC50>61200±n/a nM
Citation Chang, CJGeahlen, RL Protein-Tyrosine Kinase Inhibition: Mechanism-Based Discovery of Antitumor Agents J Nat Prod55:1529-1560 (1992) 
 
Epidermal growth factor receptor
Name:Epidermal growth factor receptor
Type:Receptor Kinase Domain
Mol. Mass.:134279.59
Organism:Homo sapiens (Human)
Description:P00533
Residue:1210
BDBM50025502
NameBDBM50025502
Synonyms:CHEMBL485483 | N-(4-Hydroxystyryl)Formamide
TypeSmall organic molecule
Emp. Form.C9H9NO2
Mol. Mass.163.1733
SMILESOc1ccc(\C=C\NC=O)cc1