Reaction Details
TargetTyrosine-protein kinase transforming protein Abl
LigandBDBM50292497
Substrate/Competitorn/a
Meas. Tech.ChEMBL_506213 (CHEMBL942402)
IC50 200000±n/a nM
Citation Chang, CJGeahlen, RL Protein-Tyrosine Kinase Inhibition: Mechanism-Based Discovery of Antitumor Agents J Nat Prod55:1529-1560 (1992) 
 
Tyrosine-protein kinase transforming protein Abl
Name:Tyrosine-protein kinase transforming protein Abl
Type:Enzyme
Mol. Mass.:81895.89
Organism:Abelson murine leukemia virus
Description:P00521
Residue:746
BDBM50292497
NameBDBM50292497
Synonyms:((2R,3S,4R,5R)-5-(6-amino-9H-purin-9-yl)-3,4-dihydroxytetrahydrofuran-2-yl)methyl 4-(phenoxysulfonyl)benzoate | CHEMBL484054
TypeSmall organic molecule
Emp. Form.C23H21N5O8S
Mol. Mass.527.507
SMILESNc1ncnc2n(cnc12)[C@@H]1O[C@H](COC(=O)c2ccc(cc2)S(=O)(=O)Oc2ccccc2)[C@@H](O)[C@H]1O