Reaction Details
TargetEpidermal growth factor receptor
LigandBDBM4301
Substrate/Competitorn/a
Meas. Tech.ChEMBL_506200 (CHEMBL941404)
IC50 10000±n/a nM
Citation Chang, CJGeahlen, RL Protein-Tyrosine Kinase Inhibition: Mechanism-Based Discovery of Antitumor Agents J Nat Prod55:1529-1560 (1992) 
 
Epidermal growth factor receptor
Name:Epidermal growth factor receptor
Type:Receptor Kinase Domain
Mol. Mass.:134279.59
Organism:Homo sapiens (Human)
Description:P00533
Residue:1210
BDBM4301
NameBDBM4301
Synonyms:(2E)-2-cyano-3-(3,4-dihydroxyphenyl)prop-2-enamide Tyrphostin deriv. 40 | benzylidenemalononitrile (BMN) deriv. 46
TypeSmall organic molecule
Emp. Form.C10H8N2O3
Mol. Mass.204.1821
SMILESNC(=O)C(=C\c1ccc(O)c(O)c1)\C#N