Reaction Details
TargetEpidermal growth factor receptor
LigandBDBM4360
Substrate/Competitorn/a
Meas. Tech.ChEMBL_506200 (CHEMBL941404)
IC50 10000±n/a nM
Citation Chang, CJGeahlen, RL Protein-Tyrosine Kinase Inhibition: Mechanism-Based Discovery of Antitumor Agents J Nat Prod55:1529-1560 (1992) 
 
Epidermal growth factor receptor
Name:Epidermal growth factor receptor
Type:Receptor Kinase Domain
Mol. Mass.:134279.59
Organism:Homo sapiens (Human)
Description:P00533
Residue:1210
BDBM4360
NameBDBM4360
Synonyms:(3,4,5,B-Tetrahydroxybenzylidene)malononitrile benzylidenemalononitrile (BMN) deriv. 44
TypeSmall organic molecule
Emp. Form.C10H6N2O4
Mol. Mass.218.1656
SMILESOc1cc(cc(O)c1O)C(=O)C(C#N)C#N