Reaction Details
TargetEpidermal growth factor receptor
LigandBDBM4350
Substrate/Competitorn/a
Meas. Tech.ChEMBL_506200 (CHEMBL941404)
IC50 200000±n/a nM
Citation Chang, CJGeahlen, RL Protein-Tyrosine Kinase Inhibition: Mechanism-Based Discovery of Antitumor Agents J Nat Prod55:1529-1560 (1992) 
 
Epidermal growth factor receptor
Name:Epidermal growth factor receptor
Type:Receptor Kinase Domain
Mol. Mass.:134279.59
Organism:Homo sapiens (Human)
Description:P00533
Residue:1210
BDBM4350
NameBDBM4350
Synonyms:(2E)-2-cyano-3-(4-hydroxyphenyl)prop-2-enoic acid | benzylidenemalononitrile (BMN) deriv. 34
TypeSmall organic molecule
Emp. Form.C10H7NO3
Mol. Mass.189.1675
SMILESOC(=O)C(=C\c1ccc(O)cc1)\C#N