Reaction Details
TargetXanthine dehydrogenase/oxidase
LigandBDBM50292533
Substrate/Competitorn/a
Meas. Tech.ChEMBL_487004 (CHEMBL1015631)
IC50 22300±n/a nM
Citation Hayashi, TSawa, KKawasaki, MArisawa, MShimizu, MMorita, N Inhibition of Cow's Milk Xanthine Oxidase by Flavonoids J Nat Prod51:345-348 (1988) 
 
Xanthine dehydrogenase/oxidase
Name:Xanthine dehydrogenase/oxidase
Type:Protein
Mol. Mass.:146809.00
Organism:Bos taurus (Bovine)
Description:P80457
Residue:1332
BDBM50292533
NameBDBM50292533
Synonyms:CHEMBL446790 | Fukugetin
TypeSmall organic molecule
Emp. Form.C30H22O11
Mol. Mass.558.4891
SMILESOc1ccc(cc1)[C@@H]1Oc2cc(O)cc(O)c2C(=O)[C@H]1c1c(O)cc(O)c2C(=O)CC(Oc12)c1ccc(O)c(O)c1