Reaction Details
TargetAngiotensin-converting enzyme
LigandBDBM50155447
Substrate/Competitorn/a
Meas. Tech.ChEMBL_483399 (CHEMBL964324)
Ki 250200±n/a nM
Citation Chen, CHLin, JYLin, CNHsu, SY Inhibition of Angiotensin-I-Converting Enzyme by Tetrahydroxyxanthones Isolated from Tripterospermum lanceolatum J Nat Prod55:691-695 (1992) 
 
Angiotensin-converting enzyme
Name:Angiotensin-converting enzyme
Type:Enzyme
Mol. Mass.:149709.01
Organism:Homo sapiens (Human)
Description:n/a
Residue:1306
BDBM50155447
NameBDBM50155447
Synonyms:1,3,6,7-Tetrahydroxy-xanthen-9-one CHEMBL187265
TypeSmall organic molecule
Emp. Form.C13H8O6
Mol. Mass.260.199
SMILESOc1cc(O)c2c(c1)oc1cc(O)c(O)cc1c2=O