Reaction Details
TargetAngiotensin-converting enzyme
LigandBDBM50292547
Substrate/Competitorn/a
Meas. Tech.ChEMBL_483399 (CHEMBL964324)
Ki 34200±n/a nM
Citation Chen, CHLin, JYLin, CNHsu, SY Inhibition of Angiotensin-I-Converting Enzyme by Tetrahydroxyxanthones Isolated from Tripterospermum lanceolatum J Nat Prod55:691-695 (1992) 
 
Angiotensin-converting enzyme
Name:Angiotensin-converting enzyme
Type:Enzyme
Mol. Mass.:149709.01
Organism:Homo sapiens (Human)
Description:n/a
Residue:1306
BDBM50292547
NameBDBM50292547
Synonyms:1,3,5,6-tetrahydroxyxanthone CHEMBL448040 | US9114126, MB6
TypeSmall organic molecule
Emp. Form.C13H8O6
Mol. Mass.260.199
SMILESOc1cc(O)c2c(c1)oc1c(O)c(O)ccc1c2=O