Reaction Details
TargetDisintegrin and metalloproteinase domain-containing protein 10
LigandBDBM50292680
Substrate/Competitorn/a
Meas. Tech.ChEMBL_496902 (CHEMBL1001997)
Ki>10000000±n/a nM
Citation Mazzola, RDZhu, ZSinning, LMcKittrick, BLavey, BSpitler, JKozlowski, JNeng-Yang, SZhou, GGuo, ZOrth, PMadison, VSun, JLundell, DNiu, X Discovery of novel hydroxamates as highly potent tumor necrosis factor-alpha converting enzyme inhibitors. Part II: optimization of the S3' pocket. Bioorg Med Chem Lett18:5809-14 (2009) 
 
Disintegrin and metalloproteinase domain-containing protein 10
Name:Disintegrin and metalloproteinase domain-containing protein 10
Type:Enzyme
Mol. Mass.:84160.93
Organism:Homo sapiens (Human)
Description:O14672
Residue:748
BDBM50292680
NameBDBM50292680
Synonyms:(1S,2R)-2-cyano-N-hydroxy-2-(4-((2-phenylquinolin-4-yl)methoxy)benzyl)cyclopropanecarboxamide | CHEMBL497769
TypeSmall organic molecule
Emp. Form.C28H23N3O3
Mol. Mass.449.5005
SMILESONC(=O)[C@H]1C[C@]1(Cc1ccc(OCc2cc(nc3ccccc23)-c2ccccc2)cc1)C#N