Reaction Details
TargetDisintegrin and metalloproteinase domain-containing protein 10
LigandBDBM50292683
Substrate/Competitorn/a
Meas. Tech.ChEMBL_496902 (CHEMBL1001997)
Ki>10000000±n/a nM
Citation Mazzola, RDZhu, ZSinning, LMcKittrick, BLavey, BSpitler, JKozlowski, JNeng-Yang, SZhou, GGuo, ZOrth, PMadison, VSun, JLundell, DNiu, X Discovery of novel hydroxamates as highly potent tumor necrosis factor-alpha converting enzyme inhibitors. Part II: optimization of the S3' pocket. Bioorg Med Chem Lett18:5809-14 (2009) 
 
Disintegrin and metalloproteinase domain-containing protein 10
Name:Disintegrin and metalloproteinase domain-containing protein 10
Type:Enzyme
Mol. Mass.:84160.93
Organism:Homo sapiens (Human)
Description:O14672
Residue:748
BDBM50292683
NameBDBM50292683
Synonyms:(1R,2S)-ethyl 2-(hydroxycarbamoyl)-1-(4-((2-phenylquinolin-4-yl)methoxy)benzyl)cyclopropanecarboxylate | CHEMBL495555
TypeSmall organic molecule
Emp. Form.C30H28N2O5
Mol. Mass.496.5537
SMILESCCOC(=O)[C@@]1(Cc2ccc(OCc3cc(nc4ccccc34)-c3ccccc3)cc2)C[C@@H]1C(=O)NO