Reaction Details
TargetDisintegrin and metalloproteinase domain-containing protein 17
LigandBDBM50292686
Substrate/Competitorn/a
Meas. Tech.ChEMBL_496896 (CHEMBL1001173)
Ki 0.540000±n/a nM
Citation Mazzola, RDZhu, ZSinning, LMcKittrick, BLavey, BSpitler, JKozlowski, JNeng-Yang, SZhou, GGuo, ZOrth, PMadison, VSun, JLundell, DNiu, X Discovery of novel hydroxamates as highly potent tumor necrosis factor-alpha converting enzyme inhibitors. Part II: optimization of the S3' pocket. Bioorg Med Chem Lett18:5809-14 (2009) 
 
Disintegrin and metalloproteinase domain-containing protein 17
Name:Disintegrin and metalloproteinase domain-containing protein 17
Type:Enzyme
Mol. Mass.:93007.89
Organism:Homo sapiens (Human)
Description:
Residue:824
BDBM50292686
NameBDBM50292686
Synonyms:(1S,2R)-2-((S)-3-(dimethylamino)pyrrolidine-1-carbonyl)-N-hydroxy-2-(4-((2-phenylquinolin-4-yl)methoxy)benzyl)cyclopropanecarboxamide | CHEMBL467798
TypeSmall organic molecule
Emp. Form.C34H36N4O4
Mol. Mass.564.674
SMILESCN(C)[C@H]1CCN(C1)C(=O)[C@@]1(Cc2ccc(OCc3cc(nc4ccccc34)-c3ccccc3)cc2)C[C@@H]1C(=O)NO