Reaction Details
TargetDisintegrin and metalloproteinase domain-containing protein 17
LigandBDBM50292688
Substrate/Competitorn/a
Meas. Tech.ChEMBL_496896 (CHEMBL1001173)
Ki 0.250000±n/a nM
Citation Mazzola, RDZhu, ZSinning, LMcKittrick, BLavey, BSpitler, JKozlowski, JNeng-Yang, SZhou, GGuo, ZOrth, PMadison, VSun, JLundell, DNiu, X Discovery of novel hydroxamates as highly potent tumor necrosis factor-alpha converting enzyme inhibitors. Part II: optimization of the S3' pocket. Bioorg Med Chem Lett18:5809-14 (2009) 
 
Disintegrin and metalloproteinase domain-containing protein 17
Name:Disintegrin and metalloproteinase domain-containing protein 17
Type:Enzyme
Mol. Mass.:93007.89
Organism:Homo sapiens (Human)
Description:
Residue:824
BDBM50292688
NameBDBM50292688
Synonyms:(1S,2R)-N-hydroxy-2-((S)-3-hydroxypyrrolidine-1-carbonyl)-2-(4-((2-phenylquinolin-4-yl)methoxy)benzyl)cyclopropanecarboxamide | CHEMBL500112
TypeSmall organic molecule
Emp. Form.C32H31N3O5
Mol. Mass.537.6056
SMILESONC(=O)[C@H]1C[C@]1(Cc1ccc(OCc2cc(nc3ccccc23)-c2ccccc2)cc1)C(=O)N1CC[C@H](O)C1