Reaction Details
TargetDisintegrin and metalloproteinase domain-containing protein 17
LigandBDBM50292682
Substrate/Competitorn/a
Meas. Tech.ChEMBL_496896 (CHEMBL1001173)
Ki 0.360000±n/a nM
Citation Mazzola, RDZhu, ZSinning, LMcKittrick, BLavey, BSpitler, JKozlowski, JNeng-Yang, SZhou, GGuo, ZOrth, PMadison, VSun, JLundell, DNiu, X Discovery of novel hydroxamates as highly potent tumor necrosis factor-alpha converting enzyme inhibitors. Part II: optimization of the S3' pocket. Bioorg Med Chem Lett18:5809-14 (2009) 
 
Disintegrin and metalloproteinase domain-containing protein 17
Name:Disintegrin and metalloproteinase domain-containing protein 17
Type:Enzyme
Mol. Mass.:93007.89
Organism:Homo sapiens (Human)
Description:
Residue:824
BDBM50292682
NameBDBM50292682
Synonyms:(1R,2S)-1-(3-fluoro-4-((2-phenylquinolin-4-yl)methoxy)benzyl)-N2-hydroxy-N1,N1-dimethylcyclopropane-1,2-dicarboxamide | CHEMBL496309
TypeSmall organic molecule
Emp. Form.C30H28FN3O4
Mol. Mass.513.5594
SMILESCN(C)C(=O)[C@@]1(Cc2ccc(OCc3cc(nc4ccccc34)-c3ccccc3)c(F)c2)C[C@@H]1C(=O)NO