Reaction Details
TargetDisintegrin and metalloproteinase domain-containing protein 17
LigandBDBM50292691
Substrate/Competitorn/a
Meas. Tech.ChEMBL_496896 (CHEMBL1001173)
Ki 0.150000±n/a nM
Citation Mazzola, RDZhu, ZSinning, LMcKittrick, BLavey, BSpitler, JKozlowski, JNeng-Yang, SZhou, GGuo, ZOrth, PMadison, VSun, JLundell, DNiu, X Discovery of novel hydroxamates as highly potent tumor necrosis factor-alpha converting enzyme inhibitors. Part II: optimization of the S3' pocket. Bioorg Med Chem Lett18:5809-14 (2009) 
 
Disintegrin and metalloproteinase domain-containing protein 17
Name:Disintegrin and metalloproteinase domain-containing protein 17
Type:Enzyme
Mol. Mass.:93007.89
Organism:Homo sapiens (Human)
Description:
Residue:824
BDBM50292691
NameBDBM50292691
Synonyms:(1R,2S)-1-(3-fluoro-4-((2-(pyrrolidin-1-yl)quinolin-4-yl)methoxy)benzyl)-N2-hydroxycyclopropane-1,2-dicarboxamide | CHEMBL468778
TypeSmall organic molecule
Emp. Form.C26H27FN4O4
Mol. Mass.478.5154
SMILESNC(=O)[C@@]1(Cc2ccc(OCc3cc(nc4ccccc34)N3CCCC3)c(F)c2)C[C@@H]1C(=O)NO