Reaction Details
TargetDisintegrin and metalloproteinase domain-containing protein 17
LigandBDBM50292696
Substrate/Competitorn/a
Meas. Tech.ChEMBL_496896 (CHEMBL1001173)
Ki 37±n/a nM
Citation Mazzola, RDZhu, ZSinning, LMcKittrick, BLavey, BSpitler, JKozlowski, JNeng-Yang, SZhou, GGuo, ZOrth, PMadison, VSun, JLundell, DNiu, X Discovery of novel hydroxamates as highly potent tumor necrosis factor-alpha converting enzyme inhibitors. Part II: optimization of the S3' pocket. Bioorg Med Chem Lett18:5809-14 (2009) 
 
Disintegrin and metalloproteinase domain-containing protein 17
Name:Disintegrin and metalloproteinase domain-containing protein 17
Type:Enzyme
Mol. Mass.:93007.89
Organism:Homo sapiens (Human)
Description:
Residue:824
BDBM50292696
NameBDBM50292696
Synonyms:(1R,2S)-ethyl 2-(hydroxycarbamoyl)-1-(4-((2-phenylpyridin-4-yl)methoxy)benzyl)cyclopropanecarboxylate | CHEMBL496368
TypeSmall organic molecule
Emp. Form.C26H26N2O5
Mol. Mass.446.495
SMILESCCOC(=O)[C@@]1(Cc2ccc(OCc3ccnc(c3)-c3ccccc3)cc2)C[C@@H]1C(=O)NO