Reaction Details
TargetDisintegrin and metalloproteinase domain-containing protein 17
LigandBDBM50292699
Substrate/Competitorn/a
Meas. Tech.ChEMBL_496896 (CHEMBL1001173)
Ki 2±n/a nM
Citation Mazzola, RDZhu, ZSinning, LMcKittrick, BLavey, BSpitler, JKozlowski, JNeng-Yang, SZhou, GGuo, ZOrth, PMadison, VSun, JLundell, DNiu, X Discovery of novel hydroxamates as highly potent tumor necrosis factor-alpha converting enzyme inhibitors. Part II: optimization of the S3' pocket. Bioorg Med Chem Lett18:5809-14 (2009) 
 
Disintegrin and metalloproteinase domain-containing protein 17
Name:Disintegrin and metalloproteinase domain-containing protein 17
Type:Enzyme
Mol. Mass.:93007.89
Organism:Homo sapiens (Human)
Description:
Residue:824
BDBM50292699
NameBDBM50292699
Synonyms:(1R,2S)-ethyl 1-(4-((2-ethylquinolin-4-yl)methoxy)benzyl)-2-(hydroxycarbamoyl)cyclopropanecarboxylate | CHEMBL495538
TypeSmall organic molecule
Emp. Form.C26H28N2O5
Mol. Mass.448.5109
SMILESCCOC(=O)[C@@]1(Cc2ccc(OCc3cc(CC)nc4ccccc34)cc2)C[C@@H]1C(=O)NO