Reaction Details
TargetRibonuclease pancreatic
LigandBDBM50292720
Substrate/Competitorn/a
Meas. Tech.ChEMBL_493877 (CHEMBL944248)
Ki 179000±n/a nM
Citation Samanta, ALeonidas, DDDasgupta, SPathak, TZographos, SEOikonomakos, NG Morpholino, piperidino, and pyrrolidino derivatives of pyrimidine nucleosides as inhibitors of ribonuclease A: synthesis, biochemical, and crystallographic evaluation. J Med Chem52:932-42 (2009) 
 
Ribonuclease pancreatic
Name:Ribonuclease pancreatic
Type:Enzyme
Mol. Mass.:16468.79
Organism:Bison bison (American bison)
Description:carboxamidomethylated RNase A
Residue:150
BDBM50292720
NameBDBM50292720
Synonyms:5'-deoxy-5'-N-morpholinouridine | CHEMBL460902
TypeSmall organic molecule
Emp. Form.C13H19N3O6
Mol. Mass.313.3065
SMILESO[C@@H]1[C@@H](CN2CCOCC2)O[C@H]([C@@H]1O)n1ccc(=O)[nH]c1=O