Reaction Details
TargetEpidermal growth factor receptor
LigandBDBM50292730
Substrate/Competitorn/a
Meas. Tech.ChEMBL_493905 (CHEMBL944276)
IC50 8.6±n/a nM
Citation La Motta, CSartini, STuccinardi, TNerini, EDa Settimo, FMartinelli, A Computational studies of epidermal growth factor receptor: docking reliability, three-dimensional quantitative structure-activity relationship analysis, and virtual screening studies. J Med Chem52:964-75 (2009) 
 
Epidermal growth factor receptor
Name:Epidermal growth factor receptor
Type:Receptor Kinase Domain
Mol. Mass.:134279.59
Organism:Homo sapiens (Human)
Description:P00533
Residue:1210
BDBM50292730
NameBDBM50292730
Synonyms:CHEMBL460736 | N-(4-(3-bromophenylamino)-1,7-naphthyridin-6-yl)-4-(1-methylhydrazinyl)but-2-enamide
TypeSmall organic molecule
Emp. Form.C19H19BrN6O
Mol. Mass.427.298
SMILESCN(N)C\C=C\C(=O)Nc1cc2c(Nc3cccc(Br)c3)ccnc2cn1