Reaction Details
TargetEpidermal growth factor receptor
LigandBDBM50292738
Substrate/Competitorn/a
Meas. Tech.ChEMBL_493905 (CHEMBL944276)
IC50 13570±n/a nM
Citation La Motta, CSartini, STuccinardi, TNerini, EDa Settimo, FMartinelli, A Computational studies of epidermal growth factor receptor: docking reliability, three-dimensional quantitative structure-activity relationship analysis, and virtual screening studies. J Med Chem52:964-75 (2009) 
 
Epidermal growth factor receptor
Name:Epidermal growth factor receptor
Type:Receptor Kinase Domain
Mol. Mass.:134279.59
Organism:Homo sapiens (Human)
Description:P00533
Residue:1210
BDBM50292738
NameBDBM50292738
Synonyms:CHEMBL472942 | N-(4-(3-chloro-4-fluorophenylamino)-7-methoxyquinolin-6-yl)-4-morpholinobut-2-enamide
TypeSmall organic molecule
Emp. Form.C24H24ClFN4O3
Mol. Mass.470.924
SMILESCOc1cc2nccc(Nc3ccc(F)c(Cl)c3)c2cc1NC(=O)\C=C\CN1CCOCC1