Reaction Details
TargetEpidermal growth factor receptor
LigandBDBM50292743
Substrate/Competitorn/a
Meas. Tech.ChEMBL_493905 (CHEMBL944276)
IC50 11100±n/a nM
Citation La Motta, CSartini, STuccinardi, TNerini, EDa Settimo, FMartinelli, A Computational studies of epidermal growth factor receptor: docking reliability, three-dimensional quantitative structure-activity relationship analysis, and virtual screening studies. J Med Chem52:964-75 (2009) 
 
Epidermal growth factor receptor
Name:Epidermal growth factor receptor
Type:Receptor Kinase Domain
Mol. Mass.:134279.59
Organism:Homo sapiens (Human)
Description:P00533
Residue:1210
BDBM50292743
NameBDBM50292743
Synonyms:CHEMBL461782 | ethyl 3-(4-bromo-5-chlorothiophene-2-sulfonamido)-4-morpholinobenzoate
TypeSmall organic molecule
Emp. Form.C17H18BrClN2O5S2
Mol. Mass.509.822
SMILESCCOC(=O)c1ccc(N2CCOCC2)c(NS(=O)(=O)c2cc(Br)c(Cl)s2)c1