Reaction Details
Target4,4'-diapophytoene synthase
LigandBDBM50049222
Substrate/Competitorn/a
Meas. Tech.ChEMBL_494370 (CHEMBL941163)
Ki 5±n/a nM
Citation Song, YLin, FYYin, FHensler, MRodrígues Poveda, CAMukkamala, DCao, RWang, HMorita, CTGonzález Pacanowska, DNizet, VOldfield, E Phosphonosulfonates are potent, selective inhibitors of dehydrosqualene synthase and staphyloxanthin biosynthesis in Staphylococcus aureus. J Med Chem52:976-88 (2009) 
 
4,4'-diapophytoene synthase
Name:4,4'-diapophytoene synthase
Type:PROTEIN
Mol. Mass.:34309.10
Organism:Staphylococcus aureus
Description:ChEMBL_1352846
Residue:287
BDBM50049222
NameBDBM50049222
Synonyms:1-Phosphono-4-[3-(4-propylphenoxy)phenyl]butylsulfonic Acid Tripotassium Salt Tripotassium salt of 4-[3-(4-propyl-phenoxy)-phenyl]-1-phosphono-butane-1-sulfonic acid
TypeSmall organic molecule
Emp. Form.C19H22O7PS
Mol. Mass.425.414
SMILESCCCc1ccc(Oc2cccc(CCCC(P([O-])([O-])=O)S([O-])(=O)=O)c2)cc1