Reaction Details
TargetCytochrome P450 1A2
LigandBDBM50041457
Substrate/Competitorn/a
Meas. Tech.ChEMBL_494883 (CHEMBL949433)
IC50 15000±n/a nM
Citation O'Neill, PMPark, BKShone, AEMaggs, JLRoberts, PStocks, PABiagini, GABray, PGGibbons, PBerry, NWinstanley, PAMukhtar, ABonar-Law, RHindley, SBambal, RBDavis, CBBates, MHart, TKGresham, SLLawrence, RMBrigandi, RAGomez-delas-Heras, FMGargallo, DVWard, SA Candidate selection and preclinical evaluation of N-tert-butyl isoquine (GSK369796), an affordable and effective 4-aminoquinoline antimalarial for the 21st century. J Med Chem52:1408-15 (2010) 
 
Cytochrome P450 1A2
Name:Cytochrome P450 1A2
Type:Enzyme
Mol. Mass.:58423.38
Organism:Homo sapiens (Human)
Description:P05177
Residue:516
BDBM50041457
NameBDBM50041457
Synonyms:4-[(7-chloroquinolin-4-yl)amino]-2-[(diethylamino)methyl]phenol CHEMBL682 | med.21724, Compound 188
TypeSmall organic molecule
Emp. Form.C20H22ClN3O
Mol. Mass.355.861
SMILESCCN(CC)Cc1cc(Nc2ccnc3cc(Cl)ccc23)ccc1O