Reaction Details
TargetGalanin receptor type 1
LigandBDBM50293023
Substrate/Competitorn/a
Meas. Tech.ChEMBL_518781 (CHEMBL960417)
Ki 0.400000±n/a nM
Citation Zhang, LRobertson, CRGreen, BRPruess, THWhite, HSBulaj, G Structural requirements for a lipoamino acid in modulating the anticonvulsant activities of systemically active galanin analogues. J Med Chem52:1310-6 (2009) 
 
Galanin receptor type 1
Name:Galanin receptor type 1
Type:Enzyme Catalytic Domain
Mol. Mass.:38976.60
Organism:Homo sapiens (Human)
Description:Galanin R1 GALR1 HUMAN::P47211
Residue:349
BDBM50293023
NameBDBM50293023
Synonyms:(Sar)WTLNSAGYLLGPKKKK | CHEMBL508036
TypeSmall organic molecule
Emp. Form.C88H143N23O22
Mol. Mass.1875.2179
SMILESCNCC(=O)O[C@@H](Cc1c[nH]c2ccccc12)C(=O)N[C@@H]([C@@H](C)O)C(=O)N[C@@H](CC(C)C)C(=O)N[C@@H](CC(N)=O)C(=O)N[C@@H](CO)C(=O)N[C@@H](C)C(=O)NCC(=O)N[C@@H](Cc1ccc(O)cc1)C(=O)N[C@@H](CC(C)C)C(=O)N[C@@H](CC(C)C)C(=O)NCC(=O)N1CCC[C@H]1C(=O)N[C@@H](CCCCN)C(=O)N[C@@H](CCCCN)C(=O)N[C@@H](CCCCN)C(=O)N[C@@H](CCCCN)C(N)=O