Reaction Details
TargetGalanin receptor type 1
LigandBDBM50293025
Substrate/Competitorn/a
Meas. Tech.ChEMBL_518781 (CHEMBL960417)
Ki 4±n/a nM
Citation Zhang, LRobertson, CRGreen, BRPruess, THWhite, HSBulaj, G Structural requirements for a lipoamino acid in modulating the anticonvulsant activities of systemically active galanin analogues. J Med Chem52:1310-6 (2009) 
 
Galanin receptor type 1
Name:Galanin receptor type 1
Type:Enzyme Catalytic Domain
Mol. Mass.:38976.60
Organism:Homo sapiens (Human)
Description:Galanin R1 GALR1 HUMAN::P47211
Residue:349
BDBM50293025
NameBDBM50293025
Synonyms:(Sar)WTLNSAGYLLGPKK(Lys-stearoyl)K | CHEMBL450827
TypeSmall organic molecule
Emp. Form.C106H177N23O23
Mol. Mass.2141.6799
(=O)NCCCC[C@H](NC(=O)[C@H](CCCCN)NC(=O)[C@H](CCCCN)NC(=O)[C@@H]1CCCN1C(=O)CNC(=O)[C@H](CC(C)C)NC(=O)[C@H](CC(C)C)NC(=O)[C@H](Cc1ccc(O)cc1)NC(=O)CNC(=O)[C@H](C)NC(=O)[C@H](CO)NC(=O)[C@H](CC(N)=O)NC(=O)[C@H](CC(C)C)NC(=O)[C@@H](NC(=O)[C@H](Cc1c[nH]c2ccccc12)OC(=O)CNC)[C@@H](C)O)C(=O)N[C@@H](CCCCN)C(N)=O