Reaction Details
TargetLuciferin 4-monooxygenase
LigandBDBM50129791
Substrate/Competitorn/a
Meas. Tech.ChEMBL_514919 (CHEMBL972645)
IC50 320±n/a nM
Citation Auld, DSZhang, YQSouthall, NTRai, GLandsman, MMacLure, JLangevin, DThomas, CJAustin, CPInglese, J A basis for reduced chemical library inhibition of firefly luciferase obtained from directed evolution. J Med Chem52:1450-8 (2010) 
 
Luciferin 4-monooxygenase
Name:Luciferin 4-monooxygenase
Synonyms:LUCI_PHOPE
Type:PROTEIN
Mol. Mass.:60658.88
Organism:Photuris pennsylvanica
Description:ChEMBL_514919
Residue:545
BDBM50129791
NameBDBM50129791
TypeSmall organic molecule
Emp. Form.C15H14N2S
Mol. Mass.254.35
SMILESCN(C)c1ccc(cc1)-c1nc2ccccc2s1