Reaction Details
TargetLuciferin 4-monooxygenase
LigandBDBM50293101
Substrate/Competitorn/a
Meas. Tech.ChEMBL_514917 (CHEMBL972643)
IC50 54±n/a nM
Citation Auld, DSZhang, YQSouthall, NTRai, GLandsman, MMacLure, JLangevin, DThomas, CJAustin, CPInglese, J A basis for reduced chemical library inhibition of firefly luciferase obtained from directed evolution. J Med Chem52:1450-8 (2010) 
 
Luciferin 4-monooxygenase
Name:Luciferin 4-monooxygenase
Synonyms:LUCI_PHOPE
Type:PROTEIN
Mol. Mass.:60658.88
Organism:Photuris pennsylvanica
Description:ChEMBL_514919
Residue:545
BDBM50293101
NameBDBM50293101
TypeSmall organic molecule
Emp. Form.C16H14N2O3
Mol. Mass.282.294
SMILESCOc1ccc(-c2nc(no2)-c2ccccc2)c(OC)c1