Reaction Details
TargetLuciferin 4-monooxygenase
LigandBDBM50293104
Substrate/Competitorn/a
Meas. Tech.ChEMBL_514916 (CHEMBL972642)
IC50 500±n/a nM
Citation Auld, DSZhang, YQSouthall, NTRai, GLandsman, MMacLure, JLangevin, DThomas, CJAustin, CPInglese, J A basis for reduced chemical library inhibition of firefly luciferase obtained from directed evolution. J Med Chem52:1450-8 (2010) 
 
Luciferin 4-monooxygenase
Name:Luciferin 4-monooxygenase
Type:PROTEIN
Mol. Mass.:60747.46
Organism:Photinus pyralis
Description:ChEMBL_938513
Residue:550
BDBM50293104
NameBDBM50293104
Synonyms:4-(5-(2-methoxyphenyl)-1,2,4-oxadiazol-3-yl)-N,N-dimethylaniline | CHEMBL473126
TypeSmall organic molecule
Emp. Form.C17H17N3O2
Mol. Mass.295.3358
SMILESCOc1ccccc1-c1nc(no1)-c1ccc(cc1)N(C)C