Reaction Details
TargetLuciferin 4-monooxygenase
LigandBDBM50129784
Substrate/Competitorn/a
Meas. Tech.ChEMBL_514920 (CHEMBL972646)
IC50 700±n/a nM
Citation Auld, DSZhang, YQSouthall, NTRai, GLandsman, MMacLure, JLangevin, DThomas, CJAustin, CPInglese, J A basis for reduced chemical library inhibition of firefly luciferase obtained from directed evolution. J Med Chem52:1450-8 (2010) 
 
Luciferin 4-monooxygenase
Name:Luciferin 4-monooxygenase
Type:PROTEIN
Mol. Mass.:60747.46
Organism:Photinus pyralis
Description:ChEMBL_938513
Residue:550
BDBM50129784
NameBDBM50129784
Synonyms:4-(6-Methoxybenzo[d]thiazol-2-yl)-N,N-dimethylaniline [4-(6-Methoxy-benzothiazol-2-yl)-phenyl]-dimethyl-amine
TypeSmall organic molecule
Emp. Form.C16H16N2OS
Mol. Mass.284.376
SMILESCOc1ccc2nc(sc2c1)-c1ccc(cc1)N(C)C