Reaction Details
TargetLuciferin 4-monooxygenase
LigandBDBM50293115
Substrate/Competitorn/a
Meas. Tech.ChEMBL_514920 (CHEMBL972646)
IC50 3200±n/a nM
Citation Auld, DSZhang, YQSouthall, NTRai, GLandsman, MMacLure, JLangevin, DThomas, CJAustin, CPInglese, J A basis for reduced chemical library inhibition of firefly luciferase obtained from directed evolution. J Med Chem52:1450-8 (2010) 
 
Luciferin 4-monooxygenase
Name:Luciferin 4-monooxygenase
Type:PROTEIN
Mol. Mass.:60747.46
Organism:Photinus pyralis
Description:ChEMBL_938513
Residue:550
BDBM50293115
NameBDBM50293115
Synonyms:2-(3,4-Dimethoxyphenyl)benzo[d]thiazol CHEMBL201610
TypeSmall organic molecule
Emp. Form.C15H13NO2S
Mol. Mass.271.334
SMILESCOc1ccc(cc1OC)-c1nc2ccccc2s1