Reaction Details
TargetLuciferin 4-monooxygenase
LigandBDBM50129784
Substrate/Competitorn/a
Meas. Tech.ChEMBL_514921 (CHEMBL972647)
IC50>50000±n/a nM
Citation Auld, DSZhang, YQSouthall, NTRai, GLandsman, MMacLure, JLangevin, DThomas, CJAustin, CPInglese, J A basis for reduced chemical library inhibition of firefly luciferase obtained from directed evolution. J Med Chem52:1450-8 (2010) 
 
Luciferin 4-monooxygenase
Name:Luciferin 4-monooxygenase
Synonyms:LUCI_PHOPE
Type:PROTEIN
Mol. Mass.:60658.88
Organism:Photuris pennsylvanica
Description:ChEMBL_514919
Residue:545
BDBM50129784
NameBDBM50129784
TypeSmall organic molecule
Emp. Form.C16H16N2OS
Mol. Mass.284.376
SMILESCOc1ccc2nc(sc2c1)-c1ccc(cc1)N(C)C