Reaction Details
TargetCyclin-dependent kinase 2
LigandBDBM50293153
Substrate/Competitorn/a
Meas. Tech.ChEMBL_496926 (CHEMBL1002021)
IC50 0.3±n/a nM
Citation Stevens, KLReno, MJAlberti, JBPrice, DJKane-Carson, LSKnick, VBShewchuk, LMHassell, AMVeal, JMDavis, STGriffin, RJPeel, MR Synthesis and evaluation of pyrazolo[1,5-b]pyridazines as selective cyclin dependent kinase inhibitors. Bioorg Med Chem Lett18:5758-62 (2009) 
 
Cyclin-dependent kinase 2
Name:Cyclin-dependent kinase 2
Type:Enzyme Subunit
Mol. Mass.:33938.17
Organism:Homo sapiens (Human)
Description:P24941
Residue:298
BDBM50293153
NameBDBM50293153
Synonyms:CHEMBL526110 TCMDC-138697
TypeSmall organic molecule
Emp. Form.C16H11N7O2
Mol. Mass.333.3042
SMILES[O-][N+](=O)c1cccc(Nc2nccc(n2)-c2cnn3ncccc23)c1