Reaction Details
TargetCyclin-dependent kinase 7
LigandBDBM50293174
Substrate/Competitorn/a
Meas. Tech.ChEMBL_496974 (CHEMBL1004615)
IC50 105±n/a nM
Citation Choong, ICSerafimova, IFan, JStockett, DChan, ECheeti, SLu, YFahr, BPham, PArkin, MRWalker, DHHoch, U A diaminocyclohexyl analog of SNS-032 with improved permeability and bioavailability properties. Bioorg Med Chem Lett18:5763-5 (2009) 
 
Cyclin-dependent kinase 7
Name:Cyclin-dependent kinase 7
Type:Enzyme Subunit
Mol. Mass.:39047.01
Organism:Homo sapiens (Human)
Description:n/a
Residue:346
BDBM50293174
NameBDBM50293174
Synonyms:(trans)-N1-(5-((5-tert-butyloxazol-2-yl)methylthio)thiazol-2-yl)cyclohexane-1,4-diamine | CHEMBL496567
TypeSmall organic molecule
Emp. Form.C17H26N4OS2
Mol. Mass.366.545
SMILESCC(C)(C)c1cnc(CSc2cnc(N[C@H]3CC[C@H](N)CC3)s2)o1