Reaction Details
TargetHistamine H3 receptor
LigandBDBM50293184
Substrate/Competitorn/a
Meas. Tech.ChEMBL_497215 (CHEMBL1003672)
Ki 165±n/a nM
Citation Letavic, MAKeith, JMLy, KSBonaventure, PFeinstein, MALord, BMiller, KLMotley, STNepomuceno, DSutton, SWCarruthers, NI 2-Aryloxymethylmorpholine histamine H(3) antagonists. Bioorg Med Chem Lett18:5796-9 (2009) 
 
Histamine H3 receptor
Name:Histamine H3 receptor
Type:G Protein-Coupled Receptor (GPCR)
Mol. Mass.:48691.47
Organism:Homo sapiens (Human)
Description:Binding assays were using CHO cells stably expressing hH3R receptors.
Residue:445
BDBM50293184
NameBDBM50293184
Synonyms:4-ethyl-2-((4-(morpholinomethyl)phenoxy)methyl)morpholine | CHEMBL498201
TypeSmall organic molecule
Emp. Form.C18H28N2O3
Mol. Mass.320.4265
SMILESCCN1CCOC(COc2ccc(CN3CCOCC3)cc2)C1