Reaction Details
TargetHistamine H3 receptor
LigandBDBM50293200
Substrate/Competitorn/a
Meas. Tech.ChEMBL_497215 (CHEMBL1003672)
Ki 2.5±n/a nM
Citation Letavic, MAKeith, JMLy, KSBonaventure, PFeinstein, MALord, BMiller, KLMotley, STNepomuceno, DSutton, SWCarruthers, NI 2-Aryloxymethylmorpholine histamine H(3) antagonists. Bioorg Med Chem Lett18:5796-9 (2009) 
 
Histamine H3 receptor
Name:Histamine H3 receptor
Type:G Protein-Coupled Receptor (GPCR)
Mol. Mass.:48691.47
Organism:Homo sapiens (Human)
Description:Binding assays were using CHO cells stably expressing hH3R receptors.
Residue:445
BDBM50293200
NameBDBM50293200
Synonyms:4-cyclopentyl-2-((4-(piperidin-1-ylmethyl)phenoxy)methyl)morpholine | CHEMBL496366
TypeSmall organic molecule
Emp. Form.C22H34N2O2
Mol. Mass.358.5176
SMILESC(Oc1ccc(CN2CCCCC2)cc1)C1CN(CCO1)C1CCCC1