Reaction Details
TargetHistamine H3 receptor
LigandBDBM50293188
Substrate/Competitorn/a
Meas. Tech.ChEMBL_497216 (CHEMBL1003673)
Ki 75±n/a nM
Citation Letavic, MAKeith, JMLy, KSBonaventure, PFeinstein, MALord, BMiller, KLMotley, STNepomuceno, DSutton, SWCarruthers, NI 2-Aryloxymethylmorpholine histamine H(3) antagonists. Bioorg Med Chem Lett18:5796-9 (2009) 
 
Histamine H3 receptor
Name:Histamine H3 receptor
Type:G Protein-Coupled Receptor (GPCR)
Mol. Mass.:48607.98
Organism:Rattus norvegicus (rat)
Description:n/a
Residue:445
BDBM50293188
NameBDBM50293188
Synonyms:4-cyclobutyl-2-((4-(morpholinomethyl)phenoxy)methyl)morpholine | CHEMBL496554
TypeSmall organic molecule
Emp. Form.C20H30N2O3
Mol. Mass.346.4638
SMILESC(Oc1ccc(CN2CCOCC2)cc1)C1CN(CCO1)C1CCC1