Reaction Details
TargetHistamine H3 receptor
LigandBDBM50293199
Substrate/Competitorn/a
Meas. Tech.ChEMBL_497216 (CHEMBL1003673)
Ki 9.8±n/a nM
Citation Letavic, MAKeith, JMLy, KSBonaventure, PFeinstein, MALord, BMiller, KLMotley, STNepomuceno, DSutton, SWCarruthers, NI 2-Aryloxymethylmorpholine histamine H(3) antagonists. Bioorg Med Chem Lett18:5796-9 (2009) 
 
Histamine H3 receptor
Name:Histamine H3 receptor
Type:G Protein-Coupled Receptor (GPCR)
Mol. Mass.:48607.98
Organism:Rattus norvegicus (rat)
Description:n/a
Residue:445
BDBM50293199
NameBDBM50293199
Synonyms:4-cyclopentyl-2-((4-(pyrrolidin-1-ylmethyl)phenoxy)methyl)morpholine | CHEMBL496167
TypeSmall organic molecule
Emp. Form.C21H32N2O2
Mol. Mass.344.491
SMILESC(Oc1ccc(CN2CCCC2)cc1)C1CN(CCO1)C1CCCC1