Reaction Details
TargetOrexin/Hypocretin receptor type 1
LigandBDBM50293234
Substrate/Competitorn/a
Meas. Tech.ChEMBL_497219 (CHEMBL1006172)
IC50 6±n/a nM
Citation Aissaoui, HKoberstein, RZumbrunn, CGatfield, JBrisbare-Roch, CJenck, FTreiber, ABoss, C N-Glycine-sulfonamides as potent dual orexin 1/orexin 2 receptor antagonists. Bioorg Med Chem Lett18:5729-33 (2009) 
 
Orexin/Hypocretin receptor type 1
Name:Orexin/Hypocretin receptor type 1
Type:Protein
Mol. Mass.:47554.50
Organism:Homo sapiens (Human)
Description:O43613
Residue:425
BDBM50293234
NameBDBM50293234
Synonyms:2-(N-(2-chloro-5-(dimethylamino)phenyl)-3,4-dimethoxyphenylsulfonamido)-N-(1,5-dimethyl-1H-pyrazol-3-yl)-N-ethylacetamide | CHEMBL496979
TypeSmall organic molecule
Emp. Form.C25H32ClN5O5S
Mol. Mass.550.07
SMILESCCN(C(=O)CN(c1cc(ccc1Cl)N(C)C)S(=O)(=O)c1ccc(OC)c(OC)c1)c1cc(C)n(C)n1