Reaction Details
TargetOrexin receptor type 2
LigandBDBM50292965
Substrate/Competitorn/a
Meas. Tech.ChEMBL_497220 (CHEMBL1006173)
IC50 5±n/a nM
Citation Aissaoui, HKoberstein, RZumbrunn, CGatfield, JBrisbare-Roch, CJenck, FTreiber, ABoss, C N-Glycine-sulfonamides as potent dual orexin 1/orexin 2 receptor antagonists. Bioorg Med Chem Lett18:5729-33 (2009) 
 
Orexin receptor type 2
Name:Orexin receptor type 2
Type:Protein
Mol. Mass.:50710.53
Organism:Homo sapiens (Human)
Description:O43614
Residue:444
BDBM50292965
NameBDBM50292965
Synonyms:2-(4-tert-butyl-N-p-tolylphenylsulfonamido)-N,N-diethylacetamide | CHEMBL455137
TypeSmall organic molecule
Emp. Form.C23H32N2O3S
Mol. Mass.416.577
SMILESCCN(CC)C(=O)CN(c1ccc(C)cc1)S(=O)(=O)c1ccc(cc1)C(C)(C)C