Reaction Details
TargetOrexin receptor type 2
LigandBDBM50292976
Substrate/Competitorn/a
Meas. Tech.ChEMBL_497220 (CHEMBL1006173)
IC50 5±n/a nM
Citation Aissaoui, HKoberstein, RZumbrunn, CGatfield, JBrisbare-Roch, CJenck, FTreiber, ABoss, C N-Glycine-sulfonamides as potent dual orexin 1/orexin 2 receptor antagonists. Bioorg Med Chem Lett18:5729-33 (2009) 
 
Orexin receptor type 2
Name:Orexin receptor type 2
Type:Protein
Mol. Mass.:50710.53
Organism:Homo sapiens (Human)
Description:O43614
Residue:444
BDBM50292976
NameBDBM50292976
Synonyms:2-(N-(2-chloro-5-(dimethylamino)phenyl)-3,4-dimethoxyphenylsulfonamido)-N,N-diethylacetamide | CHEMBL453134
TypeSmall organic molecule
Emp. Form.C22H30ClN3O5S
Mol. Mass.484.009
SMILESCCN(CC)C(=O)CN(c1cc(ccc1Cl)N(C)C)S(=O)(=O)c1ccc(OC)c(OC)c1