Reaction Details
TargetOrexin receptor type 2
LigandBDBM50293235
Substrate/Competitorn/a
Meas. Tech.ChEMBL_497220 (CHEMBL1006173)
IC50 5±n/a nM
Citation Aissaoui, HKoberstein, RZumbrunn, CGatfield, JBrisbare-Roch, CJenck, FTreiber, ABoss, C N-Glycine-sulfonamides as potent dual orexin 1/orexin 2 receptor antagonists. Bioorg Med Chem Lett18:5729-33 (2009) 
 
Orexin receptor type 2
Name:Orexin receptor type 2
Type:Protein
Mol. Mass.:50710.53
Organism:Homo sapiens (Human)
Description:O43614
Residue:444
BDBM50293235
NameBDBM50293235
Synonyms:2-(N-(6-chloro-3-methylbenzo[d]isothiazol-5-yl)-3,4-dimethoxyphenylsulfonamido)-N-ethyl-N-(pyridin-2-yl)acetamide | CHEMBL498014
TypeSmall organic molecule
Emp. Form.C25H25ClN4O5S2
Mol. Mass.561.073
SMILESCCN(C(=O)CN(c1cc2c(C)nsc2cc1Cl)S(=O)(=O)c1ccc(OC)c(OC)c1)c1ccccn1