Reaction Details
TargetEphrin type-B receptor 4
LigandBDBM50293242
Substrate/Competitorn/a
Meas. Tech.ChEMBL_497271 (CHEMBL1007022)
IC50 2±n/a nM
Citation Bardelle, CColeman, TCross, DDavenport, SKettle, JGKo, EJLeach, AGMortlock, ARead, JRoberts, NJRobins, PWilliams, EJ Inhibitors of the tyrosine kinase EphB4. Part 2: structure-based discovery and optimisation of 3,5-bis substituted anilinopyrimidines. Bioorg Med Chem Lett18:5717-21 (2009) 
 
Ephrin type-B receptor 4
Name:Ephrin type-B receptor 4
Type:Enzyme
Mol. Mass.:108273.51
Organism:Homo sapiens (Human)
Description:P54760
Residue:987
BDBM50293242
NameBDBM50293242
Synonyms:CHEMBL497198 | N4-(5-chlorobenzo[d][1,3]dioxol-4-yl)-N2-(3-(methylsulfonyl)-5-morpholinophenyl)pyrimidine-2,4-diamine
TypeSmall organic molecule
Emp. Form.C22H22ClN5O5S
Mol. Mass.503.959
SMILESCS(=O)(=O)c1cc(Nc2nccc(Nc3c4OCOc4ccc3Cl)n2)cc(c1)N1CCOCC1