Reaction Details
TargetHistone deacetylase 2
LigandBDBM50293366
Substrate/Competitorn/a
Meas. Tech.ChEMBL_571846 (CHEMBL1034714)
IC50>5000±n/a nM
Citation Dallavalle, SCincinelli, RNannei, RMerlini, LMorini, GPenco, SPisano, CVesci, LBarbarino, MZuco, VDe Cesare, MZunino, F Design, synthesis, and evaluation of biphenyl-4-yl-acrylohydroxamic acid derivatives as histone deacetylase (HDAC) inhibitors. Eur J Med Chem44:1900-12 (2009) 
 
Histone deacetylase 2
Name:Histone deacetylase 2
Type:Chromatin regulator; hydrolase; repressor
Mol. Mass.:55356.54
Organism:Homo sapiens (Human)
Description:Q92769
Residue:488
BDBM50293366
NameBDBM50293366
Synonyms:CHEMBL554573 | N-Hydroxy-E-3-(4-pyridin-4-yl-phenyl)-acrylamide
TypeSmall organic molecule
Emp. Form.C14H12N2O2
Mol. Mass.240.2573
SMILESONC(=O)\C=C\c1ccc(cc1)-c1ccncc1