Reaction Details
TargetHistone deacetylase 2
LigandBDBM50293368
Substrate/Competitorn/a
Meas. Tech.ChEMBL_571846 (CHEMBL1034714)
IC50>5000±n/a nM
Citation Dallavalle, SCincinelli, RNannei, RMerlini, LMorini, GPenco, SPisano, CVesci, LBarbarino, MZuco, VDe Cesare, MZunino, F Design, synthesis, and evaluation of biphenyl-4-yl-acrylohydroxamic acid derivatives as histone deacetylase (HDAC) inhibitors. Eur J Med Chem44:1900-12 (2009) 
 
Histone deacetylase 2
Name:Histone deacetylase 2
Type:Chromatin regulator; hydrolase; repressor
Mol. Mass.:55356.54
Organism:Homo sapiens (Human)
Description:Q92769
Residue:488
BDBM50293368
NameBDBM50293368
Synonyms:CHEMBL538967 | E,E-5-Biphenyl-4-yl-penta-2,4-dienoic acid Nhydroxyamide
TypeSmall organic molecule
Emp. Form.C17H15NO2
Mol. Mass.265.3065
SMILESONC(=O)\C=C\C=C\c1ccc(cc1)-c1ccccc1