Reaction Details
TargetHistone deacetylase 2
LigandBDBM50293369
Substrate/Competitorn/a
Meas. Tech.ChEMBL_571846 (CHEMBL1034714)
IC50>5000±n/a nM
Citation Dallavalle, SCincinelli, RNannei, RMerlini, LMorini, GPenco, SPisano, CVesci, LBarbarino, MZuco, VDe Cesare, MZunino, F Design, synthesis, and evaluation of biphenyl-4-yl-acrylohydroxamic acid derivatives as histone deacetylase (HDAC) inhibitors. Eur J Med Chem44:1900-12 (2009) 
 
Histone deacetylase 2
Name:Histone deacetylase 2
Type:Chromatin regulator; hydrolase; repressor
Mol. Mass.:55356.54
Organism:Homo sapiens (Human)
Description:Q92769
Residue:488
BDBM50293369
NameBDBM50293369
Synonyms:CHEMBL538364 | E,E-5-(4'-Methoxybiphenyl-4-yl)-penta-2,4-dienoic acid Nhydroxyamide
TypeSmall organic molecule
Emp. Form.C18H17NO3
Mol. Mass.295.3325
SMILESCOc1ccc(cc1)-c1ccc(\C=C\C=C\C(=O)NO)cc1