Reaction Details
TargetProthrombin
LigandBDBM50293383
Substrate/Competitorn/a
Meas. Tech.ChEMBL_572139 (CHEMBL1023377)
IC50 790±n/a nM
Citation Ayral, EGloanec, PBergé, Gde Nanteuil, GMennecier, PRupin, AVerbeuren, TJFulcrand, PMartinez, JHernandez, JF Design, synthesis, and biological evaluation of 1,5-benzothiazepine-4-one derivatives targeting factor VIIa/tissue factor. Bioorg Med Chem Lett19:1386-91 (2009) 
 
Prothrombin
Name:Prothrombin
Type:Protein
Mol. Mass.:70029.57
Organism:Homo sapiens (Human)
Description:P00734
Residue:622
BDBM50293383
NameBDBM50293383
Synonyms:2-[(3S)-3-[Benzylsulfonylamino]-7-(3-nitrophenyl)-4-oxo-3,4-dihydro-1,5-benzothiazepin-5(2H)-yl]-N-{4-[amino(imino)methyl]benzyl}-acetamide, trifluoroacetate | CHEMBL558349
TypeSmall organic molecule
Emp. Form.C32H30N6O6S2
Mol. Mass.658.747
SMILESNC(=N)c1ccc(CNC(=O)CN2c3cc(ccc3SC[C@@H](NS(=O)(=O)Cc3ccccc3)C2=O)-c2cccc(c2)[N+]([O-])=O)cc1