Reaction Details
TargetCoagulation factor X
LigandBDBM50293388
Substrate/Competitorn/a
Meas. Tech.ChEMBL_572141 (CHEMBL1027710)
IC50 1720±n/a nM
Citation Ayral, EGloanec, PBergé, Gde Nanteuil, GMennecier, PRupin, AVerbeuren, TJFulcrand, PMartinez, JHernandez, JF Design, synthesis, and biological evaluation of 1,5-benzothiazepine-4-one derivatives targeting factor VIIa/tissue factor. Bioorg Med Chem Lett19:1386-91 (2009) 
 
Coagulation factor X
Name:Coagulation factor X
Type:Enzyme
Mol. Mass.:54726.60
Organism:Homo sapiens (Human)
Description:n/a
Residue:488
BDBM50293388
NameBDBM50293388
Synonyms:2-[(3S)-7-Aminomethyl-3-[benzylsulfonylamino]-4-oxo-3,4-dihydro-1,5-benzothiazepin-5(2H)-yl]-N-{4-[amino(imino)methyl]benzyl}-acetamide, bistrifluoroacetate | CHEMBL554320
TypeSmall organic molecule
Emp. Form.C27H30N6O4S2
Mol. Mass.566.695
SMILESNCc1ccc2SC[C@@H](NS(=O)(=O)Cc3ccccc3)C(=O)N(CC(=O)NCc3ccc(cc3)C(N)=N)c2c1