Reaction Details
TargetTissue factor
LigandBDBM50293391
Substrate/Competitorn/a
Meas. Tech.ChEMBL_572140 (CHEMBL1024282)
IC50 2300±n/a nM
Citation Ayral, EGloanec, PBergé, Gde Nanteuil, GMennecier, PRupin, AVerbeuren, TJFulcrand, PMartinez, JHernandez, JF Design, synthesis, and biological evaluation of 1,5-benzothiazepine-4-one derivatives targeting factor VIIa/tissue factor. Bioorg Med Chem Lett19:1386-91 (2009) 
 
Tissue factor
Name:Tissue factor
Type:PROTEIN
Mol. Mass.:33067.61
Organism:Homo sapiens (Human)
Description:ChEMBL_936735
Residue:295
BDBM50293391
NameBDBM50293391
Synonyms:2-[(3S)-7-Amino-3-[benzylsulfonylamino]-4-oxo-3,4-dihydro-1,5-benzothiazepin-5(2H)-yl]-N-{4-[amino(imino)methyl]benzyl}-acetamide, bistrifluoroacetate | CHEMBL553408
TypeSmall organic molecule
Emp. Form.C26H28N6O4S2
Mol. Mass.552.668
SMILESNC(=N)c1ccc(CNC(=O)CN2c3cc(N)ccc3SC[C@@H](NS(=O)(=O)Cc3ccccc3)C2=O)cc1