Reaction Details
TargetRyanodine receptor 1
LigandBDBM50222771
Substrate/Competitorn/a
Meas. Tech.ChEMBL_572154 (CHEMBL1028510)
EC50 14000±n/a nM
Citation Lahm, GPCordova, DBarry, JD New and selective ryanodine receptor activators for insect control. Bioorg Med Chem17:4127-33 (2009) 
 
Ryanodine receptor 1
Name:Ryanodine receptor 1
Type:PROTEIN
Mol. Mass.:564886.75
Organism:Mus musculus
Description:ChEMBL_572154
Residue:5035
BDBM50222771
NameBDBM50222771
Synonyms:3-bromo-N-(4-chloro-2-methyl-6-(methylcarbamoyl)phenyl)-1-(3-chloropyridin-2-yl)-1H-pyrazole-5-carboxamide Chlorantraniliprole
TypeSmall organic molecule
Emp. Form.C18H14BrCl2N5O2
Mol. Mass.483.146
SMILESCNC(=O)c1cc(Cl)cc(C)c1NC(=O)c1cc(Br)nn1-c1ncccc1Cl