Reaction Details
TargetAcetylcholinesterase
LigandBDBM50293451
Substrate/Competitorn/a
Meas. Tech.ChEMBL_572861 (CHEMBL1034421)
Ki 0.31±n/a nM
Citation Tang, HWei, YBZhang, CNing, FXQiao, WHuang, SLMa, LHuang, ZSGu, LQ Synthesis, biological evaluation and molecular modeling of oxoisoaporphine and oxoaporphine derivatives as new dual inhibitors of acetylcholinesterase/butyrylcholinesterase. Eur J Med Chem44:2523-32 (2009) 
 
Acetylcholinesterase
Name:Acetylcholinesterase
Type:Enzyme
Mol. Mass.:71812.79
Organism:Electrophorus electricus (Electric eel)
Description:n/a
Residue:633
BDBM50293451
NameBDBM50293451
Synonyms:1-Methyl-1-[2-(7-oxo-7H-1-aza-benzo[de]anthracen-9-ylcarbamoyl)-ethyl]-piperidinium methiode | CHEMBL550075
TypeSmall organic molecule
Emp. Form.C25H26N3O2
Mol. Mass.400.4923
SMILESC[N+]1(CCC(=O)Nc2ccc-3c(c2)C(=O)c2cccc4ccnc-3c24)CCCCC1