Reaction Details
TargetTGF-beta receptor type-1
LigandBDBM50293514
Substrate/Competitorn/a
Meas. Tech.ChEMBL_570590 (CHEMBL1030214)
IC50 49±n/a nM
Citation Gellibert, FFouchet, MHNguyen, VLWang, RKrysa, Gde Gouville, ACHuet, SDodic, N Design of novel quinazoline derivatives and related analogues as potent and selective ALK5 inhibitors. Bioorg Med Chem Lett19:2277-81 (2009) 
 
TGF-beta receptor type-1
Name:TGF-beta receptor type-1
Type:enzyme
Mol. Mass.:55968.24
Organism:Homo sapiens (Human)
Description:P36897
Residue:503
BDBM50293514
NameBDBM50293514
Synonyms:2-(3-chlorophenyl)-N-(pyridin-4-yl)quinazolin-4-amine | CHEMBL571451
TypeSmall organic molecule
Emp. Form.C19H13ClN4
Mol. Mass.332.786
SMILESClc1cccc(c1)-c1nc(Nc2ccncc2)c2ccccc2n1